Reaction Details
TargetReverse transcriptase/RNaseH
LigandBDBM50368498
Substrate/Competitorn/a
Meas. Tech.ChEMBL_196935 (CHEMBL803952)
IC50>1000000±n/a nM
Citation Tan, GTWickramasinghe, ABaba, MHughes, SHMohan, PPezzuto, JMSingh, RVerma, S Potential anti-AIDS naphthalenesulfonic acid derivatives. Synthesis and inhibition of HIV-1 induced cytopathogenesis and HIV-1 and HIV-2 reverse transcriptase activities. J Med Chem35:4846-53 (1992) Reverse transcriptase/RNaseH
Name:Reverse transcriptase/RNaseH
Type:PROTEIN
Mol. Mass.:65229.15
Organism:Human immunodeficiency virus 1
Description:ChEMBL_1473730
Residue:566
BDBM50368498
NameBDBM50368498
Synonyms:CHEMBL1744159
TypeSmall organic molecule
Emp. Form.C20H15N2O10S2
Mol. Mass.507.471
SMILESCC(=O)Oc1cc(cc2cc(c(N=Nc3ccccc3)c(OC(C)=O)c12)S(O)(=O)=O)S([O-])(=O)=O