Reaction Details
TargetRyanodine receptor 1
LigandBDBM50044987
Substrate/Competitorn/a
Meas. Tech.ChEBML_198268
IC50 44±n/a nM
Citation Gerzon, KHumerickhouse, RABesch, HRBidasee, KREmmick, JTRoeske, RWTian, ZRuest, LSutko, JL Amino- and guanidinoacylryanodines: basic ryanodine esters with enhanced affinity for the sarcoplasmic reticulum Ca(2+)-release channel. J Med Chem36:1319-23 (1993) Ryanodine receptor 1
Name:Ryanodine receptor 1
Type:PROTEIN
Mol. Mass.:565099.26
Organism:Oryctolagus cuniculus
Description:ChEMBL_19634
Residue:5037
BDBM50044987
NameBDBM50044987
Synonyms:(O10eq)-beta-N,N'-Bis-Benzyloxycarbonyl-guanidinopropionylryanodine | CHEMBL27869
TypeSmall organic molecule
Emp. Form.C45H54N4O14
Mol. Mass.874.9287
SMILESCC(C)C1(O)[C@@H](OC(=O)c2ccc[nH]2)C2(O)[C@@]3(C)CC4(O)OC5([C@H](OC(=O)CCNC(NC(=O)OCc6ccccc6)=NC(=O)OCc6ccccc6)C(C)CCC35O)C2(O)C14C