Reaction Details
TargetBeta-1 adrenergic receptor
LigandBDBM50019061
Substrate/Competitorn/a
Meas. Tech.ChEBML_30207
Ki 45000±n/a nM
Citation Chen, GTKing, MGusovsky, FCreveling, CRDaly, JWChen, BHNie, JYKirk, KL Syntheses of 2,5- and 2,6-difluoronorepinephrine, 2,5-difluoroepinephrine, and 2,6-difluorophenylephrine: effect of disubstitution with fluorine on adrenergic activity. J Med Chem36:3947-55 (1994) Beta-1 adrenergic receptor
Name:Beta-1 adrenergic receptor
Type:Protein
Mol. Mass.:50486.84
Organism:Rattus norvegicus (Rat)
Description:P18090
Residue:466
BDBM50019061
NameBDBM50019061
Synonyms:(+/-)4-(2-Amino-1-hydroxy-ethyl)-5-fluoro-benzene-1,2-diol 4-(2-Amino-1-hydroxy-ethyl)-5-fluoro-benzene-1,2-diol(6-FNE) | CHEMBL281232
TypeSmall organic molecule
Emp. Form.C8H10FNO3
Mol. Mass.187.1683
SMILESNCC(O)c1cc(O)c(O)cc1F