Reaction Details
TargetEndothelin receptor type B
LigandBDBM50368774
Substrate/Competitorn/a
Meas. Tech.ChEMBL_63515 (CHEMBL677265)
IC50 0.33±n/a nM
Citation Kikuchi, TKubo, KOhtaki, TSuzuki, NAsami, TShimamoto, NWakimasu, MFujino, M Endothelin-1 analogues substituted at both position 18 and 19: highly potent endothelin antagonists with no selectivity for either receptor subtype ETA or ETB. J Med Chem36:4087-93 (1994) Endothelin receptor type B
Name:Endothelin receptor type B
Type:PROTEIN
Mol. Mass.:49389.50
Organism:Bos taurus
Description:ChEMBL_63513
Residue:441
BDBM50368774
NameBDBM50368774
Synonyms:CHEMBL1790963
TypeSmall organic molecule
Emp. Form.C109H161N25O31S5
Mol. Mass.2477.919
SMILESCC[C@H](C)[C@H](NC(=O)[C@@H](NC(=O)[C@@H](NC(=O)[C@H](CC(C)C)NC(=O)[C@H](Cc1cnc[nH]1)NC(=O)[C@@H]1CSSC[C@@H](N)C(=O)N[C@@H](CO)C(=O)N[C@@H]2CSSC[C@@H](NC(=O)[C@H](CCC(O)=O)NC(=O)[C@@H](CCCCN)NC(=O)[C@H](CC(O)=O)NC(=O)[C@@H](CCSC)NC(=O)[C@H](CC(C)C)NC(=O)[C@@H](CO)NC(=O)[C@H](CO)NC2=O)C(=O)N[C@@H](C(C)C)C(=O)N[C@H](Cc2ccc(O)cc2)C(=O)N[C@@H](Cc2ccccc2)C(=O)N1)[C@@H](C)O)[C@@H](C)CC)C(=O)N[C@@H](Cc1c[nH]c2ccccc12)C(O)=O