Reaction Details
TargetDelta-type opioid receptor
LigandBDBM50453313
Substrate/Competitorn/a
Meas. Tech.ChEMBL_145895 (CHEMBL754260)
IC50 0.320000±n/a nM
Citation Bartosz-Bechowski, HDavis, PZalewska, TSlaninova, JPorreca, FYamamura, HIHruby, VJ Cyclic enkephalin analogs with exceptional potency at peripheral delta opioid receptors. J Med Chem37:146-50 (1994) Delta-type opioid receptor
Name:Delta-type opioid receptor
Type:Enzyme Catalytic Domain
Mol. Mass.:40577.25
Organism:MOUSE
Description:P32300
Residue:372
BDBM50453313
NameBDBM50453313
Synonyms:CHEMBL2372329
TypeSmall organic molecule
Emp. Form.C28H35N5O7S2
Mol. Mass.617.737
SMILESCC1(C)SSC[C@H](NC(=O)[C@H](Cc2ccccc2)NC(=O)CNC(=O)[C@@H]1NC(=O)[C@@H](N)Cc1ccc(O)cc1)C(O)=O