Reaction Details
TargetKappa-type opioid receptor
LigandBDBM50030145
Substrate/Competitorn/a
Meas. Tech.ChEMBL_145504 (CHEMBL752146)
IC50 10±n/a nM
Citation Archer, SSeyed-Mozaffari, AJiang, QBidlack, JM 14 alpha,14' beta-[Dithiobis[(2-oxo-2,1-ethanediyl)imino]]bis (7,8-dihydromorphinone) and 14 alpha,14' beta-[dithiobis[(2-oxo-2,1- ethanediyl)imino]]bis[7,8-dihydro-N-(cyclopropylmethyl)normorphinone]: chemistry and opioid binding properties. J Med Chem37:1578-85 (1994) Kappa-type opioid receptor
Name:Kappa-type opioid receptor
Type:G Protein-Coupled Receptor (GPCR)
Mol. Mass.:42648.76
Organism:Homo sapiens (Human)
Description:P41145
Residue:380
BDBM50030145
NameBDBM50030145
Synonyms:CHEMBL290701 | bis-(1N-[4-cyclopropylmethyl-10-hydroxy-14-oxo-12-oxa-4-azapentacyclo[9.6.1.01,13.05,17.07,18]octadeca-7,9,11(18)-trien-17-yl]-2-sulfanylacetamide)
TypeSmall organic molecule
Emp. Form.C44H50N4O8S2
Mol. Mass.827.02
SMILESOc1ccc2C[C@H]3N(CC4CC4)CC[C@@]45[C@@H](Oc1c24)C(=O)CC[C@@]35NC(=O)CSSCC(=O)N[C@]12CCC(=O)[C@@H]3Oc4c5c(C[C@H]1N(CC1CC1)CC[C@@]235)ccc4O