Reaction Details
TargetProlyl endopeptidase
LigandBDBM50038885
Substrate/Competitorn/a
Meas. Tech.ChEMBL_157472 (CHEMBL765791)
IC50 1.1±n/a nM
Citation Tanaka, YNiwa, SNishioka, HYamanaka, TTorizuka, MYoshinaga, KKobayashi, NIkeda, YArai, H New potent prolyl endopeptidase inhibitors: synthesis and structure-activity relationships of indan and tetralin derivatives and their analogues. J Med Chem37:2071-8 (1994) Prolyl endopeptidase
Name:Prolyl endopeptidase
Type:Enzyme
Mol. Mass.:80688.50
Organism:Homo sapiens (Human)
Description:P48147
Residue:710
BDBM50038885
NameBDBM50038885
Synonyms:(S)-1-[(R)-3-(2-Indan-2-yl-acetyl)-thiazolidine-4-carbonyl]-pyrrolidine-2-carbonitrile | CHEMBL66088
TypeSmall organic molecule
Emp. Form.C20H23N3O2S
Mol. Mass.369.481
SMILESO=C(CC1Cc2ccccc2C1)N1CSC[C@H]1C(=O)N1CCC[C@H]1C#N