Reaction Details
TargetGag-Pol polyprotein [489-587]
LigandBDBM50368892
Substrate/Competitorn/a
Meas. Tech.ChEMBL_157711 (CHEMBL763385)
Ki 53±n/a nM
Citation Islam, INg, KYChong, KTMcQuade, TJHui, JOWilkinson, KFRush, BDRuwart, MJBorchardt, RTFisher, JF Evaluation of a vitamin-cloaking strategy for oligopeptide therapeutics: biotinylated HIV-1 protease inhibitors. J Med Chem37:293-304 (1994) Gag-Pol polyprotein [489-587]
Name:Gag-Pol polyprotein [489-587]
Type:Enzyme Subunit
Mol. Mass.:10781.16
Organism:Human immunodeficiency virus type 1
Description:P04585[489-587]
Residue:99
BDBM50368892
NameBDBM50368892
Synonyms:CHEMBL1790797
TypeSmall organic molecule
Emp. Form.C44H66N6O6S2
Mol. Mass.839.161
SMILESCC[C@@H](C)[C@H](NC(=O)[C@H](C(C)C)[C@@H](O)[C@H](O)[C@H](CC1CCCCC1)NC(=O)c1ccccc1SCCCCC[C@@H]1SCC2NC(=O)NC12)C(=O)NCc1ccccn1