Reaction Details
TargetBeta-galactosidase
LigandBDBM50292389
Substrate/Competitorn/a
Meas. Tech.ChEMBL_37295 (CHEMBL655207)
IC50 1500±n/a nM
Citation Asano, NOseki, KKizu, HMatsui, K Nitrogen-in-the-ring pyranoses and furanoses: structural basis of inhibition of mammalian glycosidases. J Med Chem37:3701-6 (1994) Beta-galactosidase
Name:Beta-galactosidase
Type:Protein
Mol. Mass.:73420.88
Organism:Bos taurus (Bovine)
Description:n/a
Residue:653
BDBM50292389
NameBDBM50292389
Synonyms:3-epi-fagomine CHEMBL456583
TypeSmall organic molecule
Emp. Form.C6H13NO3
Mol. Mass.147.1723
SMILESOC[C@H]1NCC[C@H](O)[C@@H]1O