Reaction Details
TargetBeta-glucosidase A
LigandBDBM50292389
Substrate/Competitorn/a
Meas. Tech.ChEMBL_37567 (CHEMBL647648)
IC50 100000±n/a nM
Citation Asano, NOseki, KKizu, HMatsui, K Nitrogen-in-the-ring pyranoses and furanoses: structural basis of inhibition of mammalian glycosidases. J Med Chem37:3701-6 (1994) Beta-glucosidase A
Name:Beta-glucosidase A
Type:PROTEIN
Mol. Mass.:53484.21
Organism:Caldocellum saccharolyticum
Description:ChEMBL_37437
Residue:455
BDBM50292389
NameBDBM50292389
Synonyms:3-epi-fagomine CHEMBL456583
TypeSmall organic molecule
Emp. Form.C6H13NO3
Mol. Mass.147.1723
SMILESOC[C@H]1NCC[C@H](O)[C@@H]1O