Reaction Details
TargetAminopeptidase B
LigandBDBM50036814
Substrate/Competitorn/a
Meas. Tech.ChEMBL_36048 (CHEMBL645580)
Ki 51±n/a nM
Citation Chauvel, ENCoric, PLlorens-Cortès, CWilk, SRoques, BPFournié-Zaluski, MC Investigation of the active site of aminopeptidase A using a series of new thiol-containing inhibitors. J Med Chem37:1339-46 (1994) Aminopeptidase B
Name:Aminopeptidase B
Type:PROTEIN
Mol. Mass.:72586.33
Organism:Homo sapiens (Human)
Description:ChEMBL_36048
Residue:650
BDBM50036814
NameBDBM50036814
Synonyms:2-Mercapto-4-methyl-pentanoic acid | CHEMBL27010
TypeSmall organic molecule
Emp. Form.C6H12O2S
Mol. Mass.148.223
SMILESCC(C)CC(S)C(O)=O