Reaction Details
TargetGlutamyl aminopeptidase
LigandBDBM50036824
Substrate/Competitorn/a
Meas. Tech.ChEMBL_32828 (CHEMBL646206)
Ki 140±n/a nM
Citation Chauvel, ENCoric, PLlorens-Cortès, CWilk, SRoques, BPFournié-Zaluski, MC Investigation of the active site of aminopeptidase A using a series of new thiol-containing inhibitors. J Med Chem37:1339-46 (1994) Glutamyl aminopeptidase
Name:Glutamyl aminopeptidase
Type:PROTEIN
Mol. Mass.:109226.47
Organism:Homo sapiens (Human)
Description:ChEMBL_32829
Residue:957
BDBM50036824
NameBDBM50036824
Synonyms:(S)-3-Carboxy-1-mercaptomethyl-propyl-ammonium CHEMBL28124
TypeSmall organic molecule
Emp. Form.C5H11NO2S
Mol. Mass.149.211
SMILESN[C@H](CS)CCC(O)=O