Reaction Details
TargetRibonucleoside-diphosphate reductase large subunit/subunit M2
LigandBDBM50033456
Substrate/Competitorn/a
Meas. Tech.ChEMBL_195386 (CHEMBL806875)
IC50 22±n/a nM
Citation Moss, NBeaulieu, PDuceppe, JSFerland, JMGauthier, JGhiro, EGoulet, SGrenier, LLlinas-Brunet, MPlante, R Peptidomimetic inhibitors of herpes simplex virus ribonucleotide reductase: a new class of antiviral agents. J Med Chem38:3617-23 (1995) Ribonucleoside-diphosphate reductase large subunit/subunit M2
Name:Ribonucleoside-diphosphate reductase large subunit/subunit M2
Type:Enzyme
Mol. Mass.:n/a
Description:n/a
Components:This complex has 2 components.
Component 1
Name:Ribonucleoside-diphosphate reductase large subunit
Synonyms:RIR1_HUMAN RRM1 Ribonucleoside-diphosphate reductase subunit M1 | Ribonucleotide reductase large subunit
Type:PROTEIN
Mol. Mass.:90074.67
Organism:Homo sapiens (Human)
Description:ChEMBL_90946
Residue:792
Component 2
Name:Ribonucleoside-diphosphate reductase subunit M2
Synonyms:RIR2_HUMAN RRM2 Ribonucleotide reductase small chain | Ribonucleotide reductase small subunit
Type:PROTEIN
Mol. Mass.:44868.59
Organism:Homo sapiens (Human)
Description:ChEMBL_195255
Residue:389
BDBM50033456
NameBDBM50033456
Synonyms:(S)-2-[(S)-3-Carboxy-2-((S)-2-{(S)-2-[(S)-2-cyclohexyl-2-(3-phenyl-propionylamino)-acetylamino]-3-methyl-butyrylamino}-4-oxo-4-pyrrolidin-1-yl-butyrylamino)-propionylamino]-4-methyl-pentanoic acid | CHEMBL120060
TypeSmall organic molecule
Emp. Form.C40H60N6O10
Mol. Mass.784.9386
SMILESCC(C)C[C@H](NC(=O)[C@H](CC(O)=O)NC(=O)[C@H](CC(=O)N1CCCC1)NC(=O)[C@@H](NC(=O)[C@@H](NC(=O)CCc1ccccc1)C1CCCCC1)C(C)C)C(O)=O