Reaction Details
TargetRibonucleoside-diphosphate reductase large subunit/subunit M2
LigandBDBM50033448
Substrate/Competitorn/a
Meas. Tech.ChEMBL_38663 (CHEMBL652606)
EC50 30000±n/a nM
Citation Moss, NBeaulieu, PDuceppe, JSFerland, JMGauthier, JGhiro, EGoulet, SGrenier, LLlinas-Brunet, MPlante, R Peptidomimetic inhibitors of herpes simplex virus ribonucleotide reductase: a new class of antiviral agents. J Med Chem38:3617-23 (1995) Ribonucleoside-diphosphate reductase large subunit/subunit M2
Name:Ribonucleoside-diphosphate reductase large subunit/subunit M2
Type:Enzyme
Mol. Mass.:n/a
Description:n/a
Components:This complex has 2 components.
Component 1
Name:Ribonucleoside-diphosphate reductase large subunit
Synonyms:RIR1_HUMAN RRM1 Ribonucleoside-diphosphate reductase subunit M1 | Ribonucleotide reductase large subunit
Type:PROTEIN
Mol. Mass.:90074.67
Organism:Homo sapiens (Human)
Description:ChEMBL_90946
Residue:792
Component 2
Name:Ribonucleoside-diphosphate reductase subunit M2
Synonyms:RIR2_HUMAN RRM2 Ribonucleotide reductase small chain | Ribonucleotide reductase small subunit
Type:PROTEIN
Mol. Mass.:44868.59
Organism:Homo sapiens (Human)
Description:ChEMBL_195255
Residue:389
BDBM50033448
NameBDBM50033448
Synonyms:1-[(S)-[(S)-2-((S)-2-{(S)-2-[(2-Benzyl-3-phenyl-propionyl)-methyl-amino]-3-methyl-butyrylamino}-3,3-dimethyl-butyrylamino)-4-oxo-4-pyrrolidin-1-yl-butyrylamino]-((S)-1-carboxy-3,3-dimethyl-butylcarbamoyl)-methyl]-cyclopentanecarboxylic acid | CHEMBL409908
TypeSmall organic molecule
Emp. Form.C51H74N6O10
Mol. Mass.931.1675
SMILESCC(C)[C@H](N(C)C(=O)C(Cc1ccccc1)Cc1ccccc1)C(=O)N[C@H](C(=O)N[C@@H](CC(=O)N1CCCC1)C(=O)N[C@H](C(=O)N[C@@H](CC(C)(C)C)C(O)=O)C1(CCCC1)C(O)=O)C(C)(C)C