Reaction Details
TargetThyroid hormone receptor beta
LigandBDBM50036427
Substrate/Competitorn/a
Meas. Tech.ChEMBL_143915 (CHEMBL752718)
IC50 0.100000±n/a nM
Citation Yokoyama, NWalker, GNMain, AJStanton, JLMorrissey, MMBoehm, CEngle, ANeubert, ADWasvary, JMStephan, ZF Synthesis and structure-activity relationships of oxamic acid and acetic acid derivatives related to L-thyronine. J Med Chem38:695-707 (1995) Thyroid hormone receptor beta
Name:Thyroid hormone receptor beta
Type:Enzyme Catalytic Domain
Mol. Mass.:52661.52
Organism:RAT
Description:thyroid beta 0 RAT::P18113
Residue:461
BDBM50036427
NameBDBM50036427
Synonyms:CHEMBL350265 | [3,5-Dibromo-4-(4-hydroxy-3-isopropyl-phenoxy)-phenoxy]-acetic acid
TypeSmall organic molecule
Emp. Form.C17H16Br2O5
Mol. Mass.460.114
SMILESCC(C)c1cc(Oc2c(Br)cc(OCC(O)=O)cc2Br)ccc1O