Reaction Details
TargetThyroid hormone receptor beta
LigandBDBM50036430
Substrate/Competitorn/a
Meas. Tech.ChEMBL_143915 (CHEMBL752718)
IC50 3.5±n/a nM
Citation Yokoyama, NWalker, GNMain, AJStanton, JLMorrissey, MMBoehm, CEngle, ANeubert, ADWasvary, JMStephan, ZF Synthesis and structure-activity relationships of oxamic acid and acetic acid derivatives related to L-thyronine. J Med Chem38:695-707 (1995) Thyroid hormone receptor beta
Name:Thyroid hormone receptor beta
Type:Enzyme Catalytic Domain
Mol. Mass.:52661.52
Organism:RAT
Description:thyroid beta 0 RAT::P18113
Residue:461
BDBM50036430
NameBDBM50036430
Synonyms:CHEMBL347713 | [4-(4-Hydroxy-3-isopropyl-phenoxy)-3,5-dimethyl-phenylsulfanyl]-acetic acid
TypeSmall organic molecule
Emp. Form.C19H22O4S
Mol. Mass.346.441
SMILESCC(C)c1cc(Oc2c(C)cc(SCC(O)=O)cc2C)ccc1O