Reaction Details
TargetThyroid hormone receptor beta
LigandBDBM50036406
Substrate/Competitorn/a
Meas. Tech.ChEMBL_157265 (CHEMBL765465)
IC50>5000±n/a nM
Citation Yokoyama, NWalker, GNMain, AJStanton, JLMorrissey, MMBoehm, CEngle, ANeubert, ADWasvary, JMStephan, ZF Synthesis and structure-activity relationships of oxamic acid and acetic acid derivatives related to L-thyronine. J Med Chem38:695-707 (1995) Thyroid hormone receptor beta
Name:Thyroid hormone receptor beta
Type:Enzyme Catalytic Domain
Mol. Mass.:52661.52
Organism:RAT
Description:thyroid beta 0 RAT::P18113
Residue:461
BDBM50036406
NameBDBM50036406
Synonyms:CHEMBL163380 | [3,5-Dichloro-4-(4-hydroxy-3-isopropyl-phenoxy)-phenylamino]-acetic acid
TypeSmall organic molecule
Emp. Form.C17H17Cl2NO4
Mol. Mass.370.227
SMILESCC(C)c1cc(Oc2c(Cl)cc(NCC(O)=O)cc2Cl)ccc1O