Reaction Details
TargetThyroid hormone receptor beta
LigandBDBM50225220
Substrate/Competitorn/a
Meas. Tech.ChEMBL_143914 (CHEMBL872845)
IC50 35±n/a nM
Citation Yokoyama, NWalker, GNMain, AJStanton, JLMorrissey, MMBoehm, CEngle, ANeubert, ADWasvary, JMStephan, ZF Synthesis and structure-activity relationships of oxamic acid and acetic acid derivatives related to L-thyronine. J Med Chem38:695-707 (1995) Thyroid hormone receptor beta
Name:Thyroid hormone receptor beta
Type:Enzyme Catalytic Domain
Mol. Mass.:52661.52
Organism:RAT
Description:thyroid beta 0 RAT::P18113
Residue:461
BDBM50225220
NameBDBM50225220
Synonyms:CHEMBL559 O-(4-hydroxy-3,5-diiodophenyl)-3,5-diiodo-D-tyrosine | dextrothyroxine
TypeSmall organic molecule
Emp. Form.C15H11I4NO4
Mol. Mass.776.87
SMILESN[C@H](Cc1cc(I)c(Oc2cc(I)c(O)c(I)c2)c(I)c1)C(O)=O