Reaction Details
TargetThyroid hormone receptor beta
LigandBDBM50036411
Substrate/Competitorn/a
Meas. Tech.ChEMBL_143914 (CHEMBL872845)
IC50 0.270000±n/a nM
Citation Yokoyama, NWalker, GNMain, AJStanton, JLMorrissey, MMBoehm, CEngle, ANeubert, ADWasvary, JMStephan, ZF Synthesis and structure-activity relationships of oxamic acid and acetic acid derivatives related to L-thyronine. J Med Chem38:695-707 (1995) Thyroid hormone receptor beta
Name:Thyroid hormone receptor beta
Type:Enzyme Catalytic Domain
Mol. Mass.:52661.52
Organism:RAT
Description:thyroid beta 0 RAT::P18113
Residue:461
BDBM50036411
NameBDBM50036411
Synonyms:CHEMBL163324 | N-{3,5-Dichloro-4-[3-(4-chloro-benzyl)-4-hydroxy-phenoxy]-phenyl}-oxalamic acid
TypeSmall organic molecule
Emp. Form.C21H14Cl3NO5
Mol. Mass.466.699
SMILESOC(=O)C(=O)Nc1cc(Cl)c(Oc2ccc(O)c(Cc3ccc(Cl)cc3)c2)c(Cl)c1