Reaction Details
TargetThyroid hormone receptor beta
LigandBDBM50036395
Substrate/Competitorn/a
Meas. Tech.ChEMBL_143914 (CHEMBL872845)
IC50 0.95±n/a nM
Citation Yokoyama, NWalker, GNMain, AJStanton, JLMorrissey, MMBoehm, CEngle, ANeubert, ADWasvary, JMStephan, ZF Synthesis and structure-activity relationships of oxamic acid and acetic acid derivatives related to L-thyronine. J Med Chem38:695-707 (1995) Thyroid hormone receptor beta
Name:Thyroid hormone receptor beta
Type:Enzyme Catalytic Domain
Mol. Mass.:52661.52
Organism:RAT
Description:thyroid beta 0 RAT::P18113
Residue:461
BDBM50036395
NameBDBM50036395
Synonyms:CHEMBL350199 | N-[4-(4-Hydroxy-3-isopropyl-phenoxy)-3,5-dimethyl-phenyl]-oxalamide
TypeSmall organic molecule
Emp. Form.C19H22N2O4
Mol. Mass.342.389
SMILESCC(C)c1cc(Oc2c(C)cc(NC(=O)C(N)=O)cc2C)ccc1O