Reaction Details
TargetThyroid hormone receptor beta
LigandBDBM50036402
Substrate/Competitorn/a
Meas. Tech.ChEMBL_157265 (CHEMBL765465)
IC50>5000±n/a nM
Citation Yokoyama, NWalker, GNMain, AJStanton, JLMorrissey, MMBoehm, CEngle, ANeubert, ADWasvary, JMStephan, ZF Synthesis and structure-activity relationships of oxamic acid and acetic acid derivatives related to L-thyronine. J Med Chem38:695-707 (1995) Thyroid hormone receptor beta
Name:Thyroid hormone receptor beta
Type:Enzyme Catalytic Domain
Mol. Mass.:52661.52
Organism:RAT
Description:thyroid beta 0 RAT::P18113
Residue:461
BDBM50036402
NameBDBM50036402
Synonyms:CHEMBL46882 N-[4-(4-Hydroxy-3-isopropyl-phenoxy)-3,5-dimethyl-phenyl]-oxalamic acid
TypeSmall organic molecule
Emp. Form.C19H21NO5
Mol. Mass.343.3737
SMILESCC(C)c1cc(Oc2c(C)cc(NC(=O)C(O)=O)cc2C)ccc1O