Reaction Details
Target5-hydroxytryptamine receptor 2A
LigandBDBM50036439
Substrate/Competitorn/a
Meas. Tech.ChEMBL_2605 (CHEMBL617473)
Ki 4.5±n/a nM
Citation Phillips, STde Paulis, TNeergaard, JRBaron, BMSiegel, BWSeeman, PVan Tol, HHGuan, HCSmith, HE Binding of 5H-dibenzo[a,d]cycloheptene and dibenz[b,f]oxepin analogues of clozapine to dopamine and serotonin receptors. J Med Chem38:708-14 (1995) 5-hydroxytryptamine receptor 2A
Name:5-hydroxytryptamine receptor 2A
Type:G Protein-Coupled Receptor (GPCR)
Mol. Mass.:52852.05
Organism:Rattus norvegicus (rat)
Description:Rat cortex membranes 5-HT2A receptors.
Residue:471
BDBM50036439
NameBDBM50036439
Synonyms:4-(5H-Dibenzo[a,d]cyclohepten-10-yl)-1-ethyl-1,2,3,6-tetrahydro-pyridine; hydrochloride | CHEMBL542029
TypeSmall organic molecule
Emp. Form.C22H23N
Mol. Mass.301.4247
SMILESCCN1CCC(=CC1)C1=Cc2ccccc2Cc2ccccc12