Reaction Details
TargetSubstance-P receptor
LigandBDBM50051567
Substrate/Competitorn/a
Meas. Tech.ChEMBL_205581 (CHEMBL812544)
IC50 120000±n/a nM
Citation Hirschmann, RYao, WCascieri, MAStrader, CDMaechler, LCichy-Knight, MAHynes, Jvan Rijn, RDSprengeler, PASmith, AB Synthesis of potent cyclic hexapeptide NK-1 antagonists. Use of a minilibrary in transforming a peptidal somatostatin receptor ligand into an NK-1 receptor ligand via a polyvalent peptidomimetic. J Med Chem39:2441-8 (1996) 
 
Substance-P receptor
Name:Substance-P receptor
Type:G Protein-Coupled Receptor (GPCR)
Mol. Mass.:46254.43
Organism:Homo sapiens (Human)
Description:P25103
Residue:407
BDBM50051567
NameBDBM50051567
Synonyms:5-{(2R,3R,4S,5R,6R)-3,4,5-Tris-benzyloxy-6-[2-(1H-indol-3-yl)-ethoxy]-tetrahydro-pyran-2-ylmethoxy}-pentylamine CHEMBL282618
TypeSmall organic molecule
Emp. Form.C42H50N2O6
Mol. Mass.678.8562
SMILESNCCCCCOC[C@H]1O[C@@H](OCCc2c[nH]c3ccccc23)[C@H](OCc2ccccc2)[C@@H](OCc2ccccc2)[C@@H]1OCc1ccccc1