Reaction Details
TargetSubstance-P receptor
LigandBDBM50051568
Substrate/Competitorn/a
Meas. Tech.ChEMBL_205734 (CHEMBL809501)
IC50>1000±n/a nM
Citation Hirschmann, RYao, WCascieri, MAStrader, CDMaechler, LCichy-Knight, MAHynes, Jvan Rijn, RDSprengeler, PASmith, AB Synthesis of potent cyclic hexapeptide NK-1 antagonists. Use of a minilibrary in transforming a peptidal somatostatin receptor ligand into an NK-1 receptor ligand via a polyvalent peptidomimetic. J Med Chem39:2441-8 (1996) 
 
Substance-P receptor
Name:Substance-P receptor
Type:G Protein-Coupled Receptor (GPCR)
Mol. Mass.:46254.43
Organism:Homo sapiens (Human)
Description:P25103
Residue:407
BDBM50051568
NameBDBM50051568
Synonyms:(3S,6S,9S,12R,15S,18S)-9-(4-Amino-butyl)-3-benzyl-15-(4-hydroxy-benzyl)-12-(1H-indol-3-ylmethyl)-6-isopropyl-1,18-dimethyl-1,4,7,10,13,16hexaaza-cyclooctadecane-2,5,8,11,14,17-hexaone seglitide
TypeSmall organic molecule
Emp. Form.C44H56N8O7
Mol. Mass.808.9648
SMILESCC(C)[C@@H]1NC(=O)[C@H](CCCCN)NC(=O)[C@@H](Cc2c[nH]c3ccccc23)NC(=O)[C@H](Cc2ccc(O)cc2)NC(=O)[C@H](C)N(C)C(=O)[C@H](Cc2ccccc2)NC1=O