Reaction Details
TargetAcetylcholine receptor subunit alpha/Neuronal acetylcholine receptor subunit beta-4
LigandBDBM50369150
Substrate/Competitorn/a
Meas. Tech.ChEMBL_142739 (CHEMBL745043)
EC50 29000±n/a nM
Citation Cosford, NDBleicher, LHerbaut, AMcCallum, JSVernier, JMDawson, HWhitten, JPAdams, PChavez-Noriega, LCorrea, LDCrona, JHMahaffy, LSMenzaghi, FRao, TSReid, RSacaan, AISantori, EStauderman, KAWhelan, KLloyd, GKMcDonald, IA (S)-(-)-5-ethynyl-3-(1-methyl-2-pyrrolidinyl)pyridine maleate (SIB-1508Y): a novel anti-parkinsonian agent with selectivity for neuronal nicotinic acetylcholine receptors. J Med Chem39:3235-7 (1996) 
 
Acetylcholine receptor subunit alpha/Neuronal acetylcholine receptor subunit beta-4
Name:Acetylcholine receptor subunit alpha/Neuronal acetylcholine receptor subunit beta-4
Synonyms:Nicotinic acetylcholine receptor alpha2/beta4
Type:n/a
Mol. Mass.:n/a
Description:ASSAY_ID of ChEMBL is 964979
Components:This complex has 2 components.
Component 1
Name:Acetylcholine receptor subunit alpha
Type:Ion channel
Mol. Mass.:54542.01
Organism:Homo sapiens (Human)
Description:n/a
Residue:482
Component 2
Name:Neuronal acetylcholine receptor subunit beta-4
Synonyms:ACHB4_HUMAN Cholinergic, Nicotinic Alpha6Beta3Beta4Alpha5 Nicotinic acetylcholine receptor alpha6/alpha3/beta4
Type:Enzyme Catalytic Domain
Mol. Mass.:56388.51
Organism:Homo sapiens (Human)
Description:Cholinergic, Nicotinic Alpha6Beta3Beta4Alpha5 0 HUMAN::P30926
Residue:498
BDBM50369150
NameBDBM50369150
Synonyms:CHEMBL1788226
TypeSmall organic molecule
Emp. Form.C12H14N2
Mol. Mass.186.253
SMILESCN1CCC[C@@H]1c1cncc(c1)C#C