Reaction Details
TargetAdenosylhomocysteinase
LigandBDBM50369159
Substrate/Competitorn/a
Meas. Tech.ChEMBL_196742 (CHEMBL857626)
Ki 320±n/a nM
Citation Wnuk, SFLiu, SYuan, CSBorchardt, RTRobins, MJ Inactivation of S-adenosyl-L-homocysteine hydrolase by amide and ester derivatives of adenosine-5'-carboxylic acid. J Med Chem39:4162-6 (1996) 
 
Adenosylhomocysteinase
Name:Adenosylhomocysteinase
Type:PROTEIN
Mol. Mass.:47714.06
Organism:Homo sapiens (Human)
Description:ChEMBL_1507791
Residue:432
BDBM50369159
NameBDBM50369159
Synonyms:CHEMBL610148
TypeSmall organic molecule
Emp. Form.C12H14ClN5O5
Mol. Mass.343.723
SMILESNc1ncnc2n(cnc12)C1O[C@@H]([C@@H](O)[C@H]1O)C(=O)OCCCl