Reaction Details
TargetAdenosylhomocysteinase
LigandBDBM50369162
Substrate/Competitorn/a
Meas. Tech.ChEMBL_196742 (CHEMBL857626)
Ki 710±n/a nM
Citation Wnuk, SFLiu, SYuan, CSBorchardt, RTRobins, MJ Inactivation of S-adenosyl-L-homocysteine hydrolase by amide and ester derivatives of adenosine-5'-carboxylic acid. J Med Chem39:4162-6 (1996) 
 
Adenosylhomocysteinase
Name:Adenosylhomocysteinase
Type:PROTEIN
Mol. Mass.:47714.06
Organism:Homo sapiens (Human)
Description:ChEMBL_1507791
Residue:432
BDBM50369162
NameBDBM50369162
Synonyms:CHEMBL610384
TypeSmall organic molecule
Emp. Form.C14H19N5O5
Mol. Mass.337.3312
SMILESCCCCOC(=O)[C@H]1OC([C@H](O)[C@@H]1O)n1cnc2c(N)ncnc12