Reaction Details
TargetAdenosylhomocysteinase
LigandBDBM50369163
Substrate/Competitorn/a
Meas. Tech.ChEMBL_196742 (CHEMBL857626)
Ki 48500±n/a nM
Citation Wnuk, SFLiu, SYuan, CSBorchardt, RTRobins, MJ Inactivation of S-adenosyl-L-homocysteine hydrolase by amide and ester derivatives of adenosine-5'-carboxylic acid. J Med Chem39:4162-6 (1996) 
 
Adenosylhomocysteinase
Name:Adenosylhomocysteinase
Type:PROTEIN
Mol. Mass.:47714.06
Organism:Homo sapiens (Human)
Description:ChEMBL_1507791
Residue:432
BDBM50369163
NameBDBM50369163
Synonyms:CHEMBL610101
TypeSmall organic molecule
Emp. Form.C16H16N6O4
Mol. Mass.356.336
SMILESNc1ncnc2n(cnc12)C1O[C@@H]([C@@H](O)[C@H]1O)C(=O)Nc1ccccc1