Reaction Details
TargetAdenosylhomocysteinase
LigandBDBM50051435
Substrate/Competitorn/a
Meas. Tech.ChEMBL_196742 (CHEMBL857626)
Ki 39±n/a nM
Citation Wnuk, SFLiu, SYuan, CSBorchardt, RTRobins, MJ Inactivation of S-adenosyl-L-homocysteine hydrolase by amide and ester derivatives of adenosine-5'-carboxylic acid. J Med Chem39:4162-6 (1996) 
 
Adenosylhomocysteinase
Name:Adenosylhomocysteinase
Type:PROTEIN
Mol. Mass.:47714.06
Organism:Homo sapiens (Human)
Description:ChEMBL_1507791
Residue:432
BDBM50051435
NameBDBM50051435
Synonyms:5'-Dehydroadenosine 9-beta-D-ribo-pentodialdo-1,4-furanosyl-9H-purin-6-amine | CHEMBL308037
TypeSmall organic molecule
Emp. Form.C10H11N5O4
Mol. Mass.265.2254
SMILESNc1ncnc2n(cnc12)[C@@H]1O[C@H](C=O)[C@@H](O)[C@H]1O