Reaction Details
TargetAcetylcholinesterase
LigandBDBM50029941
Substrate/Competitorn/a
Meas. Tech.ChEMBL_27803 (CHEMBL636513)
Ki 47±n/a nM
Citation Inoue, AKawai, TWakita, MIimura, YSugimoto, HKawakami, Y The simulated binding of (+/-)-2,3-dihydro-5,6-dimethoxy-2-[[1-(phenylmethyl)-4-piperidinyl]meth yl] -1H-inden-1-one hydrochloride (E2020) and related inhibitors to free and acylated acetylcholinesterases and corresponding structure-activity analyses. J Med Chem39:4460-70 (1996) 
 
Acetylcholinesterase
Name:Acetylcholinesterase
Type:n/a
Mol. Mass.:65900.74
Organism:Tetronarce californica (Pacific electric ray) (Torpedo californica)
Description:P04058
Residue:586
BDBM50029941
NameBDBM50029941
Synonyms:2-[2-(1-Benzyl-piperidin-4-yl)-ethyl]-5,6-dimethoxy-indan-1-one; hydrochloride CHEMBL545317
TypeSmall organic molecule
Emp. Form.C25H31NO3
Mol. Mass.393.5185
SMILESCOc1cc2CC(CCC3CCN(Cc4ccccc4)CC3)C(=O)c2cc1OC