Reaction Details
TargetNeprilysin
LigandBDBM50050158
Substrate/Competitorn/a
Meas. Tech.ChEMBL_144463 (CHEMBL755110)
IC50 1.3±n/a nM
Citation Coric, PTurcaud, SMeudal, HRoques, BPFournie-Zaluski, MC Optimal recognition of neutral endopeptidase and angiotensin-converting enzyme active sites by mercaptoacyldipeptides as a means to design potent dual inhibitors. J Med Chem39:1210-9 (1996) 
 
Neprilysin
Name:Neprilysin
Type:Enzyme
Mol. Mass.:85570.75
Organism:Oryctolagus cuniculus (rabbit)
Description:NEP was purified to homogeneity from rabbit kidney.
Residue:750
BDBM50050158
NameBDBM50050158
Synonyms:1-[(S)-2-((R)-2-Mercapto-3-phenyl-propionylamino)-propionyl]-pyrrolidine-2-carboxylic acid | CHEMBL20010
TypeSmall organic molecule
Emp. Form.C17H22N2O4S
Mol. Mass.350.433
SMILESC[C@H](NC(=O)[C@H](S)Cc1ccccc1)C(=O)N1CCCC1C(O)=O