Reaction Details
TargetNeprilysin
LigandBDBM50050138
Substrate/Competitorn/a
Meas. Tech.ChEMBL_144463 (CHEMBL755110)
IC50 2.2±n/a nM
Citation Coric, PTurcaud, SMeudal, HRoques, BPFournie-Zaluski, MC Optimal recognition of neutral endopeptidase and angiotensin-converting enzyme active sites by mercaptoacyldipeptides as a means to design potent dual inhibitors. J Med Chem39:1210-9 (1996) 
 
Neprilysin
Name:Neprilysin
Type:Enzyme
Mol. Mass.:85570.75
Organism:Oryctolagus cuniculus (rabbit)
Description:NEP was purified to homogeneity from rabbit kidney.
Residue:750
BDBM50050138
NameBDBM50050138
Synonyms:(S)-3-(4-Hydroxy-phenyl)-2-[(S)-2-((S)-2-mercapto-3-phenyl-propionylamino)-4-methyl-pentanoylamino]-propionic acid | CHEMBL19494
TypeSmall organic molecule
Emp. Form.C24H30N2O5S
Mol. Mass.458.57
SMILESCC(C)C[C@H](NC(=O)[C@@H](S)Cc1ccccc1)C(=O)N[C@@H](Cc1ccc(O)cc1)C(O)=O