Reaction Details
TargetAdenosylhomocysteinase
LigandBDBM50369255
Substrate/Competitorn/a
Meas. Tech.ChEMBL_196553 (CHEMBL801948)
Ki 111±n/a nM
Citation Wnuk, SFYuan, CSBorchardt, RTBalzarini, JDe Clercq, ERobins, MJ Anticancer and antiviral effects and inactivation of S-adenosyl-L-homocysteine hydrolase with 5'-carboxaldehydes and oximes synthesized from adenosine and sugar-modified analogues. J Med Chem40:1608-18 (1997) 
 
Adenosylhomocysteinase
Name:Adenosylhomocysteinase
Type:PROTEIN
Mol. Mass.:47714.06
Organism:Homo sapiens (Human)
Description:ChEMBL_1507791
Residue:432
BDBM50369255
NameBDBM50369255
Synonyms:CHEMBL605900
TypeSmall organic molecule
Emp. Form.C12H16N6O4
Mol. Mass.308.2932
SMILESCCO\N=C\[C@H]1OC([C@H](O)[C@@H]1O)n1cnc2c(N)ncnc12