Reaction Details
TargetMelanocortin receptor 3
LigandBDBM50454555
Substrate/Competitorn/a
Meas. Tech.ChEMBL_106013 (CHEMBL716369)
IC50 26±n/a nM
Citation Haskell-Luevano, CNikiforovich, GSharma, SDYang, YKDickinson, CHruby, VJGantz, I Biological and conformational examination of stereochemical modifications using the template melanotropin peptide, Ac-Nle-c[Asp-His-Phe-Arg-Trp-Ala-Lys]-NH2, on human melanocortin receptors. J Med Chem40:1738-48 (1997) 
 
Melanocortin receptor 3
Name:Melanocortin receptor 3
Type:Enzyme
Mol. Mass.:36044.86
Organism:Homo sapiens (Human)
Description:P41968
Residue:323
BDBM50454555
NameBDBM50454555
Synonyms:CHEMBL2115441
TypeSmall organic molecule
Emp. Form.C53H74N16O10
Mol. Mass.1095.2559
SMILESCCCC[C@H](NC(C)=O)C(=O)N[C@H]1CC(=O)NCCCC[C@H](NC(=O)[C@H](C)NC(=O)[C@H](Cc2c[nH]c3ccccc23)NC(=O)[C@H](CCCN=C(N)N)NC(=O)[C@@H](Cc2ccccc2)NC(=O)[C@H](Cc2c[nH]cn2)NC1=O)C(N)=O