Reaction Details
TargetMelanocyte-stimulating hormone receptor
LigandBDBM50058160
Substrate/Competitorn/a
Meas. Tech.ChEMBL_105835 (CHEMBL716494)
IC50 1.9±n/a nM
Citation Haskell-Luevano, CNikiforovich, GSharma, SDYang, YKDickinson, CHruby, VJGantz, I Biological and conformational examination of stereochemical modifications using the template melanotropin peptide, Ac-Nle-c[Asp-His-Phe-Arg-Trp-Ala-Lys]-NH2, on human melanocortin receptors. J Med Chem40:1738-48 (1997) 
 
Melanocyte-stimulating hormone receptor
Name:Melanocyte-stimulating hormone receptor
Type:Enzyme
Mol. Mass.:34717.23
Organism:Homo sapiens (Human)
Description:Q01726
Residue:317
BDBM50058160
NameBDBM50058160
Synonyms:(3R,6S,9R,12S,15R,18R,26R)-18-Acetylamino-12-benzyl-9-(3-guanidino-propyl)-15-(3H-imidazol-4-ylmethyl)-6-(1H-indol-3-ylmethyl)-3-methyl-2,5,8,11,14,17,20-heptaoxo-1,4,7,10,13,16,21heptaaza-cyclohexacosane-26-carboxylic acid amide | CHEMBL410217
TypeSmall organic molecule
Emp. Form.C47H63N15O9
Mol. Mass.982.0982
SMILESC[C@H]1NC(=O)[C@H](Cc2c[nH]c3ccccc23)NC(=O)[C@@H](CCCNC(N)=N)NC(=O)[C@H](Cc2ccccc2)NC(=O)[C@@H](Cc2cnc[nH]2)NC(=O)[C@@H](CC(=O)NCCCC[C@@H](NC1=O)C(N)=O)NC(C)=O