Reaction Details
TargetTissue-type plasminogen activator
LigandBDBM50060711
Substrate/Competitorn/a
Meas. Tech.ChEMBL_208240 (CHEMBL872720)
Ki 84000±n/a nM
Citation Tucker, TJLumma, WCLewis, SDGardell, SJLucas, BJSisko, JTLynch, JJLyle, EABaskin, EPWoltmann, RFAppleby, SDChen, IWDancheck, KBNaylor-Olsen, AMKrueger, JACooper, CMVacca, JP Synthesis of a series of potent and orally bioavailable thrombin inhibitors that utilize 3,3-disubstituted propionic acid derivatives in the P3 position. J Med Chem40:3687-93 (1997) 
 
Tissue-type plasminogen activator
Name:Tissue-type plasminogen activator
Type:Enzyme
Mol. Mass.:62931.08
Organism:Homo sapiens (Human)
Description:n/a
Residue:562
BDBM50060711
NameBDBM50060711
Synonyms:(S)-1-(3,3-Dicyclohexyl-propionyl)-pyrrolidine-2-carboxylic acid (4-amino-cyclohexylmethyl)-amide; hydrochloride | CHEMBL555333
TypeSmall organic molecule
Emp. Form.C27H47N3O2
Mol. Mass.445.681
SMILESNC1CCC(CNC(=O)[C@@H]2CCCN2C(=O)CC(C2CCCCC2)C2CCCCC2)CC1