Reaction Details
TargetDelta-type opioid receptor
LigandBDBM50061291
Substrate/Competitorn/a
Meas. Tech.ChEMBL_146770 (CHEMBL857690)
IC50 0.20±n/a nM
Citation Hruby, VJBartosz-Bechowski, HDavis, PSlaninova, JZalewska, TStropova, DPorreca, FYamamura, HI Cyclic enkephalin analogues with exceptional potency and selectivity for delta-opioid receptors. J Med Chem40:3957-62 (1998) 
 
Delta-type opioid receptor
Name:Delta-type opioid receptor
Type:G Protein-Coupled Receptor (GPCR)
Mol. Mass.:40465.04
Organism:Rattus norvegicus (rat)
Description:Competition binding assays were using CHO-K1 cell membranes expressing the opioid receptor.
Residue:372
BDBM50061291
NameBDBM50061291
Synonyms:(S)-2-{[(4R,7S,13S)-13-[(S)-2-Amino-3-(4-hydroxy-phenyl)-propionylamino]-7-(4-bromo-benzyl)-3,3,14,14-tetramethyl-6,9,12-trioxo-1,2-dithia-5,8,11-triaza-cyclotetradecane-4-carbonyl]-amino}-3-phenyl-propionic acid | CHEMBL340176
TypeSmall organic molecule
Emp. Form.C39H47BrN6O8S2
Mol. Mass.871.86
SMILESCC1(C)SSC(C)(C)[C@@H](NC(=O)[C@@H](N)Cc2ccc(O)cc2)C(=O)NCC(=O)N[C@@H](Cc2ccc(Br)cc2)C(=O)N[C@@H]1C(=O)N[C@@H](Cc1ccccc1)C(O)=O