Reaction Details
TargetIntegrase
LigandBDBM50056908
Substrate/Competitorn/a
Meas. Tech.ChEMBL_90895 (CHEMBL699508)
IC50 600±n/a nM
Citation Neamati, NHong, HMazumder, AWang, SSunder, SNicklaus, MCMilne, GWProksa, BPommier, Y Depsides and depsidones as inhibitors of HIV-1 integrase: discovery of novel inhibitors through 3D database searching. J Med Chem40:942-51 (1997) 
 
Integrase
Name:Integrase
Synonyms:Human immunodeficiency virus type 1 integrase
Type:PROTEIN
Mol. Mass.:32231.48
Organism:Human immunodeficiency virus 1
Description:ChEMBL_90865
Residue:288
BDBM50056908
NameBDBM50056908
TypeSmall organic molecule
Emp. Form.C25H24O12
Mol. Mass.516.4509
SMILESO[C@@H]1C[C@@](O)(C[C@@H](OC(=O)\C=C\c2ccc(O)c(O)c2)[C@H]1OC(=O)\C=C\c1ccc(O)c(O)c1)C(O)=O