Reaction Details
TargetIntegrase
LigandBDBM50327036
Substrate/Competitorn/a
Meas. Tech.ChEMBL_90890 (CHEMBL697789)
IC50 87800±n/a nM
Citation Neamati, NHong, HMazumder, AWang, SSunder, SNicklaus, MCMilne, GWProksa, BPommier, Y Depsides and depsidones as inhibitors of HIV-1 integrase: discovery of novel inhibitors through 3D database searching. J Med Chem40:942-51 (1997) 
 
Integrase
Name:Integrase
Synonyms:Human immunodeficiency virus type 1 integrase
Type:PROTEIN
Mol. Mass.:32231.48
Organism:Human immunodeficiency virus 1
Description:ChEMBL_90865
Residue:288
BDBM50327036
NameBDBM50327036
TypeSmall organic molecule
Emp. Form.C16H18O9
Mol. Mass.354.3087
SMILESO[C@@H]1C[C@](O)(C[C@@H](OC(=O)\C=C\c2ccc(O)c(O)c2)[C@@H]1O)C(O)=O