Reaction Details
TargetSodium channel protein type 2 subunit alpha
LigandBDBM50066417
Substrate/Competitorn/a
Meas. Tech.ChEMBL_202575 (CHEMBL806326)
IC50 110±n/a nM
Citation Reddy, NLFan, WMagar, SSPerlman, MEYost, EZhang, LBerlove, DFischer, JBBurke-Howie, KWolcott, TDurant, GJ Synthesis and pharmacological evaluation of N,N'-diarylguanidines as potent sodium channel blockers and anticonvulsant agents. J Med Chem41:3298-302 (1998) 
 
Sodium channel protein type 2 subunit alpha
Name:Sodium channel protein type 2 subunit alpha
Type:PROTEIN
Mol. Mass.:227854.11
Organism:Rattus norvegicus
Description:ChEMBL_1516893
Residue:2005
BDBM50066417
NameBDBM50066417
Synonyms:CHEMBL112806 | N-(4-Benzyloxy-phenyl)-N'-(4-tert-butyl-phenyl)-guanidine
TypeSmall organic molecule
Emp. Form.C24H27N3O
Mol. Mass.373.4907
SMILESCC(C)(C)c1ccc(NC(N)=Nc2ccc(OCc3ccccc3)cc2)cc1