Reaction Details
TargetNitric oxide synthase, inducible
LigandBDBM50049251
Substrate/Competitorn/a
Meas. Tech.ChEMBL_89190 (CHEMBL700508)
IC50 26000±n/a nM
Citation Hagen, TJBergmanis, AAKramer, SWFok, KFSchmelzer, AEPitzele, BSSwenton, LJerome, GMKornmeier, CMMoore, WMBranson, LFConnor, JRManning, PTCurrie, MGHallinan, EA 2-Iminopyrrolidines as potent and selective inhibitors of human inducible nitric oxide synthase. J Med Chem41:3675-83 (1998) 
 
Nitric oxide synthase, inducible
Name:Nitric oxide synthase, inducible
Type:Homodimer
Mol. Mass.:131141.95
Organism:Homo sapiens (Human)
Description:P35228
Residue:1153
BDBM50049251
NameBDBM50049251
Synonyms:CHEMBL161318 Pyrrolidin-(2Z)-ylideneamine
TypeSmall organic molecule
Emp. Form.C4H8N2
Mol. Mass.84.1197
SMILESNC1=NCCC1