Reaction Details
TargetAdenosylhomocysteinase
LigandBDBM50369394
Substrate/Competitorn/a
Meas. Tech.ChEMBL_197351 (CHEMBL800530)
Ki 3800±n/a nM
Citation Robins, MJWnuk, SFYang, XYuan, CSBorchardt, RTBalzarini, JDe Clercq, E Inactivation of S-adenosyl-L-homocysteine hydrolase and antiviral activity with 5',5',6',6'-tetradehydro-6'-deoxy-6'-halohomoadenosine analogues (4'-haloacetylene analogues derived from adenosine). J Med Chem41:3857-64 (1998) 
 
Adenosylhomocysteinase
Name:Adenosylhomocysteinase
Type:PROTEIN
Mol. Mass.:47714.06
Organism:Homo sapiens (Human)
Description:ChEMBL_1507791
Residue:432
BDBM50369394
NameBDBM50369394
Synonyms:CHEMBL608943
TypeSmall organic molecule
Emp. Form.C11H10BrN5O3
Mol. Mass.340.133
SMILESNc1ncnc2n(cnc12)C1O[C@H](C#CBr)[C@@H](O)[C@H]1O