Reaction Details
Target5-hydroxytryptamine receptor 3A/3B
LigandBDBM50053611
Substrate/Competitorn/a
Meas. Tech.ChEMBL_2994 (CHEMBL619785)
Ki 38±n/a nM
Citation Cappelli, AAnzini, MVomero, SMennuni, LMakovec, FDoucet, EHamon, MBruni, GRomeo, MRMenziani, MCDe Benedetti, PGLanger, T Novel potent and selective central 5-HT3 receptor ligands provided with different intrinsic efficacy. 1. Mapping the central 5-HT3 receptor binding site by arylpiperazine derivatives. J Med Chem41:728-41 (1998) 
 
5-hydroxytryptamine receptor 3A/3B
Name:5-hydroxytryptamine receptor 3A/3B
Type:n/a
Mol. Mass.:n/a
Description:ASSAY_ID of EBI is 2974
Components:This complex has 2 components.
Component 1
Name:5-hydroxytryptamine receptor 3B
Synonyms:5HT3B_RAT Serotonin (5-HT) receptor
Type:PROTEIN
Mol. Mass.:50328.78
Organism:Rattus norvegicus
Description:EBI_11885
Residue:437
Component 2
Name:5-hydroxytryptamine receptor 3A
Synonyms:5-HT3 5HT3A_RAT Htr3 Serotonin (5-HT) receptor | Zacopride site-R
Type:Enzyme Catalytic Domain
Mol. Mass.:55428.70
Organism:RAT
Description:5-HT3 HTR3A RAT::P35563
Residue:483
BDBM50053611
NameBDBM50053611
Synonyms:1-(6-Chloro-pyridin-2-yl)-4-methyl-piperazine | CHEMBL337213
TypeSmall organic molecule
Emp. Form.C10H14ClN3
Mol. Mass.211.691
SMILESCN1CCN(CC1)c1cccc(Cl)n1