Reaction Details
TargetMuscarinic acetylcholine receptor M1
LigandBDBM50004656
Substrate/Competitorn/a
Meas. Tech.ChEMBL_138551 (CHEMBL746418)
EC50 4600±n/a nM
Citation Jeppesen, LOlesen, PHHansen, LSheardown, MJThomsen, CRasmussen, TJensen, AFChristensen, MSRimvall, KWard, JSWhitesitt, CCalligaro, DOBymaster, FPDelapp, NWFelder, CCShannon, HESauerberg, P 1-(1,2,5-Thiadiazol-4-yl)-4-azatricyclo[2.2.1.0(2,6)]heptanes as new potent muscarinic M1 agonists: structure-activity relationship for 3-aryl-2-propyn-1-yloxy and 3-aryl-2-propyn-1-ylthio derivatives. J Med Chem42:1999-2006 (1999) 
 
Muscarinic acetylcholine receptor M1
Name:Muscarinic acetylcholine receptor M1
Type:Protein
Mol. Mass.:51442.54
Organism:Homo sapiens (Human)
Description:P11229
Residue:460
BDBM50004656
NameBDBM50004656
Synonyms:(2-Carbamoyloxy-ethyl)-trimethyl-ammonium (2-Hydroxyethyl)trimethyl ammonium chloride carbamate (carbachol)(2-Carbamoyloxy-ethyl)-trimethyl-ammonium 2-((Aminocarbonyl)oxy)-N,N,N-trimethylethanaminum chloride 2-(carbamoyloxy)-N,N,N-trimethylethanaminium chloride CARBASTAT Carbachol chloride Choline carbamate chloride Choline chlorine carbamate Karbamoylcholin chlorid | MIOSTAT
TypeSmall organic molecule
Emp. Form.C6H15N2O2
Mol. Mass.147.195
SMILESC[N+](C)(C)CCOC(N)=O