Reaction Details
TargetAnionic trypsin
LigandBDBM50080475
Substrate/Competitorn/a
Meas. Tech.ChEMBL_212180 (CHEMBL817744)
Ki 1000±n/a nM
Citation Ewing, WRBecker, MRManetta, VEDavis, RSPauls, HWMason, HChoi-Sledeski, YMGreen, DCha, DSpada, APCheney, DLMason, JSMaignan, SGuilloteau, JPBrown, KColussi, DBentley, RBostwick, JKasiewski, CJMorgan, SRLeadley, RJDunwiddie, CTPerrone, MHChu, V Design and structure-activity relationships of potent and selective inhibitors of blood coagulation factor Xa. J Med Chem42:3557-71 (1999) 
 
Anionic trypsin
Name:Anionic trypsin
Type:PROTEIN
Mol. Mass.:26281.39
Organism:Bos taurus
Description:ChEMBL_212177
Residue:247
BDBM50080475
NameBDBM50080475
Synonyms:2-[[(S)-1-(3-Carbamimidoyl-benzyl)-2-oxo-pyrrolidin-3-yl]-(7-methoxy-naphthalene-2-sulfonyl)-amino]-acetamide | CHEMBL419049
TypeSmall organic molecule
Emp. Form.C25H27N5O5S
Mol. Mass.509.577
SMILESCOc1ccc2ccc(cc2c1)S(=O)(=O)N(CC(N)=O)[C@H]1CCN(Cc2cccc(c2)C(N)=N)C1=O