Reaction Details
TargetProthrombin
LigandBDBM50080473
Substrate/Competitorn/a
Meas. Tech.ChEMBL_208339 (CHEMBL813571)
Ki>4000±n/a nM
Citation Ewing, WRBecker, MRManetta, VEDavis, RSPauls, HWMason, HChoi-Sledeski, YMGreen, DCha, DSpada, APCheney, DLMason, JSMaignan, SGuilloteau, JPBrown, KColussi, DBentley, RBostwick, JKasiewski, CJMorgan, SRLeadley, RJDunwiddie, CTPerrone, MHChu, V Design and structure-activity relationships of potent and selective inhibitors of blood coagulation factor Xa. J Med Chem42:3557-71 (1999) 
 
Prothrombin
Name:Prothrombin
Type:Protein
Mol. Mass.:70029.57
Organism:Homo sapiens (Human)
Description:P00734
Residue:622
BDBM50080473
NameBDBM50080473
Synonyms:3-[(S)-3-(Naphthalene-2-sulfonylamino)-2-oxo-piperidin-1-ylmethyl]-benzamidine | CHEMBL118836
TypeSmall organic molecule
Emp. Form.C23H24N4O3S
Mol. Mass.436.527
SMILESNC(=N)c1cccc(CN2CCC[C@H](NS(=O)(=O)c3ccc4ccccc4c3)C2=O)c1