Reaction Details
TargetAnionic trypsin
LigandBDBM50080504
Substrate/Competitorn/a
Meas. Tech.ChEMBL_212180 (CHEMBL817744)
Ki>2900±n/a nM
Citation Ewing, WRBecker, MRManetta, VEDavis, RSPauls, HWMason, HChoi-Sledeski, YMGreen, DCha, DSpada, APCheney, DLMason, JSMaignan, SGuilloteau, JPBrown, KColussi, DBentley, RBostwick, JKasiewski, CJMorgan, SRLeadley, RJDunwiddie, CTPerrone, MHChu, V Design and structure-activity relationships of potent and selective inhibitors of blood coagulation factor Xa. J Med Chem42:3557-71 (1999) 
 
Anionic trypsin
Name:Anionic trypsin
Type:PROTEIN
Mol. Mass.:26281.39
Organism:Bos taurus
Description:ChEMBL_212177
Residue:247
BDBM50080504
NameBDBM50080504
Synonyms:3-[(S)-3-(3'-Methyl-biphenyl-4-sulfonylamino)-2-oxo-pyrrolidin-1-ylmethyl]-benzamidine | CHEMBL120341
TypeSmall organic molecule
Emp. Form.C25H26N4O3S
Mol. Mass.462.564
SMILESCc1cccc(c1)-c1ccc(cc1)S(=O)(=O)N[C@H]1CCN(Cc2cccc(c2)C(N)=N)C1=O