Reaction Details
TargetCoagulation factor X
LigandBDBM50080508
Substrate/Competitorn/a
Meas. Tech.ChEMBL_49301 (CHEMBL661582)
Ki 380±n/a nM
Citation Ewing, WRBecker, MRManetta, VEDavis, RSPauls, HWMason, HChoi-Sledeski, YMGreen, DCha, DSpada, APCheney, DLMason, JSMaignan, SGuilloteau, JPBrown, KColussi, DBentley, RBostwick, JKasiewski, CJMorgan, SRLeadley, RJDunwiddie, CTPerrone, MHChu, V Design and structure-activity relationships of potent and selective inhibitors of blood coagulation factor Xa. J Med Chem42:3557-71 (1999) 
 
Coagulation factor X
Name:Coagulation factor X
Type:Enzyme
Mol. Mass.:54726.60
Organism:Homo sapiens (Human)
Description:n/a
Residue:488
BDBM50080508
NameBDBM50080508
Synonyms:3-[(S)-2-Oxo-3-(4-phenoxy-benzenesulfonylamino)-pyrrolidin-1-ylmethyl]-benzamidine | CHEMBL119249
TypeSmall organic molecule
Emp. Form.C24H24N4O4S
Mol. Mass.464.537
SMILESNC(=N)c1cccc(CN2CC[C@H](NS(=O)(=O)c3ccc(Oc4ccccc4)cc3)C2=O)c1