Reaction Details
TargetCoagulation factor X
LigandBDBM50080513
Substrate/Competitorn/a
Meas. Tech.ChEMBL_49301 (CHEMBL661582)
Ki>10000±n/a nM
Citation Ewing, WRBecker, MRManetta, VEDavis, RSPauls, HWMason, HChoi-Sledeski, YMGreen, DCha, DSpada, APCheney, DLMason, JSMaignan, SGuilloteau, JPBrown, KColussi, DBentley, RBostwick, JKasiewski, CJMorgan, SRLeadley, RJDunwiddie, CTPerrone, MHChu, V Design and structure-activity relationships of potent and selective inhibitors of blood coagulation factor Xa. J Med Chem42:3557-71 (1999) 
 
Coagulation factor X
Name:Coagulation factor X
Type:Enzyme
Mol. Mass.:54726.60
Organism:Homo sapiens (Human)
Description:n/a
Residue:488
BDBM50080513
NameBDBM50080513
Synonyms:3-[(S)-3-(Naphthalene-2-sulfonylamino)-pyrrolidin-1-ylmethyl]-benzamidine | CHEMBL326046
TypeSmall organic molecule
Emp. Form.C22H24N4O2S
Mol. Mass.408.517
SMILESNC(=N)c1cccc(CN2CC[C@@H](C2)NS(=O)(=O)c2ccc3ccccc3c2)c1