Reaction Details
TargetProthrombin
LigandBDBM50080499
Substrate/Competitorn/a
Meas. Tech.ChEMBL_208339 (CHEMBL813571)
Ki 2600±n/a nM
Citation Ewing, WRBecker, MRManetta, VEDavis, RSPauls, HWMason, HChoi-Sledeski, YMGreen, DCha, DSpada, APCheney, DLMason, JSMaignan, SGuilloteau, JPBrown, KColussi, DBentley, RBostwick, JKasiewski, CJMorgan, SRLeadley, RJDunwiddie, CTPerrone, MHChu, V Design and structure-activity relationships of potent and selective inhibitors of blood coagulation factor Xa. J Med Chem42:3557-71 (1999) 
 
Prothrombin
Name:Prothrombin
Type:Protein
Mol. Mass.:70029.57
Organism:Homo sapiens (Human)
Description:P00734
Residue:622
BDBM50080499
NameBDBM50080499
Synonyms:3-[(S)-3-(7-Amino-naphthalene-2-sulfonylamino)-2-oxo-pyrrolidin-1-ylmethyl]-benzamidine | CHEMBL93681
TypeSmall organic molecule
Emp. Form.C22H23N5O3S
Mol. Mass.437.515
SMILESNC(=N)c1cccc(CN2CC[C@H](NS(=O)(=O)c3ccc4ccc(N)cc4c3)C2=O)c1